franchissmt
type: ObjectProperty
comment: Franchissement.Cet attribut informe sur le niveau de l?objet par rapport à la surface du sol.
domain: Class
  union of: Chemin
  union of: Route
  union of: Route nommée
  union of: Route primaire
  union of: Route secondaire
range: Class
  union of: Gué
  union of: Pont
  union of: Radier
  union of: Tunnel

Arrondissement
type: DatatypeProperty
comment: Nom de l?arrondissement de rattachement de la commune. L?arrondissement est une unité administrative située hiérarchiquement entre la commune et le département.
domain: Commune
range: string

Borne début droite
type: DatatypeProperty
comment: Borne début droite. Numéro de borne à droite du tronçon en son sommet initial.
range: int
domain: Class
  union of: Route
  union of: Route nommée
  union of: Route primaire
  union of: Route secondaire

Borne début gauche
type: DatatypeProperty
comment: Borne début gauche. Numéro de borne à gauche du tronçon en son sommet initial.
range: int
domain: Class
  union of: Route
  union of: Route nommée
  union of: Route primaire
  union of: Route secondaire

Borne fin droite
type: DatatypeProperty
comment: Borne fin droite. Numéro de borne à droite du tronçon en son sommet final.
range: int
domain: Class
  union of: Route
  union of: Route nommée
  union of: Route primaire
  union of: Route secondaire

Borne fin gauche
type: DatatypeProperty
comment: Borne fin gauche. Numéro de borne à gauche du tronçon en son sommet final.
range: int
domain: Class
  union of: Route
  union of: Route nommée
  union of: Route primaire
  union of: Route secondaire

Canton
type: DatatypeProperty
comment: Nom du canton de rattachement.Le canton est une unité de découpage non électoral du territoire. Il s?agit d?un canton au sens INSEE du terme : ce peut être un regroupement de communes ou une commune.
domain: Commune
range: string

Code INSEE
type: DatatypeProperty
comment: Code INSEE de l'arrondissement sur 5 caractères.
range: string
domain: Class
  union of: Arrondissement
  union of: Commune

Code voie droite
type: DatatypeProperty
comment: Identifiant droite. Identifiant de la voie associée au côté droit du tronçon.Il est obtenu par concaténation du numéro d?INSEE (5 caractères) et du code Rivoli (4 caractères) de la voie associée au côté droit du tronçon.
range: string
domain: Class
  union of: Route
  union of: Route nommée
  union of: Route primaire
  union of: Route secondaire

Code voie gauche
type: DatatypeProperty
comment: Identifiant gauche. Identifiant de la voie associée au côté gauche du tronçon.Il est obtenu par concaténation du numéro d?INSEE (5 caractères) et du code Rivoli (4 caractères) de la voie associée au côté gauche du tronçon.
range: string
domain: Class
  union of: Route
  union of: Route nommée
  union of: Route primaire
  union of: Route secondaire

Département
type: DatatypeProperty
comment: Nom du département de rattachement de la commune.
domain: Commune
range: string

Etat de la route
type: DatatypeProperty
comment: Etat du tronçon.
range: string
domain: Class
  union of: Route
  union of: Route nommée
  union of: Route primaire
  union of: Route secondaire

Fictif
type: DatatypeProperty
comment: La valeur ?oui? indique que la géométrie du tronçon de route n'est pas significative. La présence de ce dernier sert à raccorder une bretelle à l?axe d?une chaussée afin d'assurer la continuité du réseau routier linéaire.
range: string
domain: Class
  union of: Route
  union of: Route nommée
  union of: Route primaire
  union of: Route secondaire

Gestionnaire administratif
type: DatatypeProperty
comment: Gestionnaire. Définit le gestionnaire administratif d?une route. Toutes les routes classées possèdent un ?Gestionnaire?. Il existe différentes catégories de routes pour lesquelles le gestionnaire diffère : pour les routes départementales, il s?agit du gestionnaire départemental de la route au sens administratif (c?est-à-dire le numéro de département), pour les routes nationales et les autoroutes non concédées, le gestionnaire correspond également au gestionnaire départemental de la route (au sens administratif), pour les autoroutes concédées, le gestionnaire est la société concessionnaire d?autoroute (une correspondance est établie entre ces sociétés et un code en trois lettres), les routes codées sur les bretelles d?échangeurs identifiés prennent le gestionnaire de la route à laquelle l?échangeur est rattaché.
range: string
domain: Class
  union of: Route
  union of: Route nommée
  union of: Route primaire
  union of: Route secondaire

Hauteur
type: DatatypeProperty
comment: Hauteur du réservoir correspondant à la différence entre le z le plus élevé du pourtour du réservoir et un point situé au pied. La hauteur est arrondie au mètre.
range: int
domain: Class
  union of: Bâti indifferencié
  union of: Bâti industriel
  union of: Bâti remarquable
  union of: Construction légère
  union of: Réservoir

Identifiant
type: DatatypeProperty
comment: Identifiant du toponyme. Cet identifiant est unique. Il est stable d?une édition à l?autre.
range: string
domain: Class
  union of: Arrondissement
  union of: Bâti indifferencié
  union of: Bâti industriel
  union of: Bâti remarquable
  union of: Chef lieu
  union of: Chemin
  union of: Cimetière
  union of: Commune
  union of: Construction légère
  union of: Construction linéaire
  union of: Construction ponctuelle
  union of: Construction surfacique
  union of: Lieu dit habité
  union of: Lieu dit non habité
  union of: Pai administratif militaire
  union of: Pai culture loisirs
  union of: Pai espace naturel
  union of: Pai gestion des eaux
  union of: Pai hydrographie
  union of: Pai industriel et commercial
  union of: Pai orographie
  union of: Pai religieux
  union of: Pai sante
  union of: Pai science enseignement
  union of: Pai sport
  union of: Pai transport
  union of: Pai zone habitation
  union of: Piste aérodrome
  union of: Réservoir
  union of: Route
  union of: Route nommée
  union of: Route primaire
  union of: Route secondaire
  union of: Surface activité
  union of: Surface route
  union of: Terrain sport
  union of: Toponyme communication
  union of: Toponyme divers

Importance du toponyme
type: DatatypeProperty
comment: Importance du toponyme dans son environnement.
domain: Class
  union of: Chef lieu
  union of: Lieu dit habité
  union of: Lieu dit non habité
  union of: Pai administratif militaire
  union of: Pai culture loisirs
  union of: Pai espace naturel
  union of: Pai gestion des eaux
  union of: Pai hydrographie
  union of: Pai industriel et commercial
  union of: Pai orographie
  union of: Pai religieux
  union of: Pai sante
  union of: Pai science enseignement
  union of: Pai sport
  union of: Pai transport
  union of: Pai zone habitation
  union of: Route
  union of: Route nommée
  union of: Route primaire
  union of: Route secondaire
  union of: Toponyme communication
  union of: Toponyme divers
range: Datatype
  one of: 1
  one of: 2
  one of: 3
  one of: 4
  one of: 5
  one of: 6
  one of: 7
  one of: 8
  one of: nc
  one of: nr

Code INSEE commune droite
type: DatatypeProperty
comment: INSEE Commune droite. Numéro d?INSEE de la commune à droite du tronçon par rapport à son sens de numérisation.
range: string
domain: Class
  union of: Route
  union of: Route nommée
  union of: Route primaire
  union of: Route secondaire

Code INSEE commune gauche
type: DatatypeProperty
comment: INSEE Commune gauche. Numéro d?INSEE de la commune à gauche du tronçon par rapport à son sens de numérisation.
range: string
domain: Class
  union of: Route
  union of: Route nommée
  union of: Route primaire
  union of: Route secondaire

Itinéraire européen
type: DatatypeProperty
comment: Itinéraire européen. Numéro de route européenne : une route européenne emprunte en général le réseau autoroutier ou national (exceptionnellement départemental ou non classé).
range: string
domain: Class
  union of: Route
  union of: Route nommée
  union of: Route primaire
  union of: Route secondaire

Itinéraire vert
type: DatatypeProperty
comment: Itinéraire vert. Indique l?appartenance ou non d?un tronçon routier au réseau vert. Le réseau vert, composé de pôles verts et de liaisons vertes, couvre l?ensemble du territoire français.Les pôles verts sont composés de communes de plus de 23.000 habitants en province et de 39.000 habitants en Ile-de-France, ainsi que certains pôles d?activités administratifs, économiques, touristiques ou industriels. On retient seulement le réseau vert de transit entre pôles verts. Le réseau vert de rabattement, à l?intérieur des villes, et le réseau vert conseillé aux poids lourds ne sont pas retenus.
range: string
domain: Class
  union of: Route
  union of: Route nommée
  union of: Route primaire
  union of: Route secondaire

Largeur
type: DatatypeProperty
comment: Largeur de chaussée. Largeur de chaussée (d?accotement à accotement) exprimée en mètres.
range: float
domain: Class
  union of: Route
  union of: Route nommée
  union of: Route primaire
  union of: Route secondaire

Date de mise en service
type: DatatypeProperty
comment: Date de mise en service. Définit la date prévue ou la date effective de mise en service d?un tronçon de route. Cet attribut n'est rempli que pour les tronçons en construction, il est à ?1000-01-01? dans les autres cas. Les tronçons qui possèdent une date de mise en service sont complètement fermés aux véhicules avant cette date.
range: string
domain: Class
  union of: Route
  union of: Route nommée
  union of: Route primaire
  union of: Route secondaire

Multi canton
type: DatatypeProperty
comment: Multi canton.Précise si la commune est constituée de plusieurs cantons.
domain: Commune
range: Datatype
  one of: non
  one of: oui

Nombre de voies
type: DatatypeProperty
comment: Nombre de voies.Nombre total de voies d?une route, d?une rue ou d?une chaussée de route à chaussées séparées.Lorsque les voies ne sont pas matérialisées, l?attribut indique le nombre maximum de voies de circulation effectivement utilisées dans des conditions normales de circulation.L'augmentation du nombre de voies au niveau d'un carrefour pour permettre de tourner plus facilement à droite ou à gauche n'est pas prise en compte, ainsi que les voies d'accélération ou de décélération des échangeurs d'autoroute.
range: int
domain: Class
  union of: Route
  union of: Route nommée
  union of: Route primaire
  union of: Route secondaire

Nom
type: DatatypeProperty
comment: Orthographe du toponyme validée par le bureau de Toponymie.
range: string
domain: Class
  union of: Arrondissement
  union of: Chef lieu
  union of: Commune
  union of: Lieu dit habité
  union of: Lieu dit non habité
  union of: Toponyme communication
  union of: Toponyme divers

Nom itinéraire
type: DatatypeProperty
comment: Nom d?itinéraire. Définit un parcours routier nommé.
range: string
domain: Class
  union of: Chemin
  union of: Route
  union of: Route nommée
  union of: Route primaire
  union of: Route secondaire

Nom rue droite
type: DatatypeProperty
comment: Nom rue droite. Une rue est un ensemble de tronçons de route associés à un même nom. Une rue est identifiée par son nom dans une commune donnée. « NOM_RUE_D » est le nom porté par la rue pour la commune dont le numéro INSEE est identique à la valeur de l?attribut « INSEECOM_D ». Dans les résidences portant un nom avec des allées comportant également des noms, on garde le nom servant à l?adressage. Dans certains cas le toponyme qui sert à l?adressage est un nom de lieu-dit. Il servira à nommer la voie qui dessert ces adresses. Les lettres « LD » placées devant le toponyme serviront à les identifier.
range: string
domain: Class
  union of: Route
  union of: Route nommée
  union of: Route primaire
  union of: Route secondaire

Nom rue gauche
type: DatatypeProperty
comment: Nom rue gauche. Une rue est un ensemble de tronçons de route associés à un même nom. Une rue est identifiée par son nom dans une commune donnée. « NOM_RUE_G » est le nom porté par la rue pour la commune dont le numéro INSEE est identique à la valeur de l?attribut « INSEECOM_G ». Dans les résidences portant un nom avec des allées comportant également des noms, on garde le nom servant à l?adressage. Dans certains cas le toponyme qui sert à l?adressage est un nom de lieu-dit. Il servira à nommer la voie qui dessert ces adresses. Les lettres « LD » placées devant le toponyme serviront à les identifier.
range: string
domain: Class
  union of: Route
  union of: Route nommée
  union of: Route primaire
  union of: Route secondaire

Numéro
type: DatatypeProperty
comment: Désigne le classement administratif d'un tronçon routier.
range: string
domain: Class
  union of: Route
  union of: Route nommée
  union of: Route primaire
  union of: Route secondaire

Origine
type: DatatypeProperty
comment: Source de l'information.
range: Datatype
  one of: bdcarto
  one of: bdnyme
  one of: bdparcellaire
  one of: bdtopo
  one of: calculé
  one of: fichier
  one of: géoroute
  one of: nr
  one of: orthophotographie
  one of: plan
  one of: scan25
  one of: terrain
domain: Class
  union of: Pai administratif militaire
  union of: Pai culture loisirs
  union of: Pai espace naturel
  union of: Pai gestion des eaux
  union of: Pai hydrographie
  union of: Pai industriel et commercial
  union of: Pai orographie
  union of: Pai religieux
  union of: Pai sante
  union of: Pai science enseignement
  union of: Pai sport
  union of: Pai transport
  union of: Pai zone habitation
  union of: Surface activité

Origine du bâtiment
type: DatatypeProperty
comment: Attribut précisant d?où est issu le bâtiment, de quelle base, plan ou levé.
range: Datatype
  one of: autre
  one of: bdtopo
  one of: cadastre
  one of: nr
  one of: terrain
domain: Class
  union of: Bâti indifferencié
  union of: Bâti industriel
  union of: Bâti remarquable
  union of: Construction légère
  union of: Réservoir

Origine du nom
type: DatatypeProperty
comment: Origine du toponyme. Attribut précisant l?origine de la donnée.
range: Datatype
  one of: bdcarto
  one of: bdnyme
  one of: bdparcellaire
  one of: bdtopo
  one of: fichier
  one of: géoroute
  one of: nr
  one of: plan
  one of: scan25
  one of: terrain
domain: Class
  union of: Chef lieu
  union of: Lieu dit habité
  union of: Lieu dit non habité
  union of: Toponyme communication
  union of: Toponyme divers

Population
type: DatatypeProperty
comment: Population de la commune. Population sans « double compte » de la commune en nombre d?habitants : certaines catégories de population (militaires, prisonniers, étudiants, etc.) recensées dans plusieurs lieux d?activité ou de résidence ne sont comptées qu?une seule fois.
domain: Commune
range: int

Position par rapport au sol
type: DatatypeProperty
comment: Position par rapport au sol. Donne le niveau de l?objet par rapport à la surface du sol (valeur négative pour un objet souterrain, nulle pour un objet au sol et positive pour un objet en sursol). Si l?objet en sursol passe au dessus d?autres objets en sursol, sa valeur « position par rapport au sol » est égale à « 1 + le nombre d?objets intercalés ». De la même façon, un souterrain peut prendre une valeur « position par rapport au sol » égale à « ? 1 ? le nombre d?objets souterrains intercalés ».
range: int
domain: Class
  union of: Chemin
  union of: Route
  union of: Route nommée
  union of: Route primaire
  union of: Route secondaire

Précision altimétrique
type: DatatypeProperty
comment: Précision géométrique altimétrique. Attribut précisant la précision géométrique en altimétrie de la donnée.
domain: Class
  union of: Bâti indifferencié
  union of: Bâti industriel
  union of: Bâti remarquable
  union of: Chemin
  union of: Cimetière
  union of: Construction légère
  union of: Construction linéaire
  union of: Construction ponctuelle
  union of: Construction surfacique
  union of: Piste aérodrome
  union of: Réservoir
  union of: Route
  union of: Route nommée
  union of: Route primaire
  union of: Route secondaire
  union of: Surface route
  union of: Terrain sport
range: Datatype
  one of: 1.0
  one of: 2.0
  one of: 20.0
  one of: 9999.0

Précision planimétrique
type: DatatypeProperty
comment: Précision géométrique planimétrique. Attribut précisant la précision géométrique en planimétrie de la donnée.
range: Datatype
  one of: 0.0
  one of: 1.0
  one of: 10.0
  one of: 2.0
  one of: 30.0
  one of: 5.0
domain: Class
  union of: Arrondissement
  union of: Bâti indifferencié
  union of: Bâti industriel
  union of: Bâti remarquable
  union of: Chemin
  union of: Cimetière
  union of: Commune
  union of: Construction légère
  union of: Construction linéaire
  union of: Construction ponctuelle
  union of: Construction surfacique
  union of: Piste aérodrome
  union of: Réservoir
  union of: Route
  union of: Route nommée
  union of: Route primaire
  union of: Route secondaire
  union of: Surface route
  union of: Terrain sport

Région
type: DatatypeProperty
comment: Nom de la région de rattachement de la commune.
domain: Commune
range: string

Sens de circulation
type: DatatypeProperty
comment: Sens de circulation autorisée pour les automobiles sur les voies.
domain: Class
  union of: Route
  union of: Route nommée
  union of: Route primaire
  union of: Route secondaire
range: Datatype
  one of: direct
  one of: double
  one of: inverse
  one of: nc
  one of: nr

Statut
type: DatatypeProperty
comment: Précise le rôle le plus élevé joué par la commune.
domain: Commune
range: Datatype
  one of: capitale_d__état
  one of: chef-lieu_de_canton
  one of: commune_simple
  one of: préfecture
  one of: préfecture_de_région
  one of: sous-préfecture

Toponyme
type: DatatypeProperty
comment: Nom validé par l?Equipe Produit Toponymie qui garantit son orthographe.
range: string
domain: Class
  union of: Pai administratif militaire
  union of: Pai culture loisirs
  union of: Pai espace naturel
  union of: Pai gestion des eaux
  union of: Pai hydrographie
  union of: Pai industriel et commercial
  union of: Pai orographie
  union of: Pai religieux
  union of: Pai sante
  union of: Pai science enseignement
  union of: Pai sport
  union of: Pai transport
  union of: Pai zone habitation

Type d'adressage
type: DatatypeProperty
comment: Type d?adressage. Renseigne sur le type d?adressage du tronçon.
range: Datatype
  one of: autre
  one of: classique
  one of: linéaire
  one of: métrique
  one of: nc
  one of: nr
domain: Class
  union of: Route
  union of: Route nommée
  union of: Route primaire
  union of: Route secondaire

Z final
type: DatatypeProperty
comment: Altitude finale : c?est l?altitude du sommet final du tronçon.
range: float
domain: Class
  union of: Chemin
  union of: Route
  union of: Route nommée
  union of: Route primaire
  union of: Route secondaire

Z initial
type: DatatypeProperty
comment: Altitude initiale : c?est l?altitude du sommet initial du tronçon.
range: float
domain: Class
  union of: Chemin
  union of: Route
  union of: Route nommée
  union of: Route primaire
  union of: Route secondaire

Z maximal
type: DatatypeProperty
comment: Altitude maximale d?un objet linéaire ou surfacique. Cette information est issue de la saisie photogrammétrique et concerne des objets dont les points initiaux et finaux ne sont pas caractéristiques de l?altitude de l?objet (objets surfaciques, objets linéaires isolés). Pour des objets surfaciques comme les bâtiments ou les réservoirs, il s?agit de l?altitude maximum du pourtour tel qu?il est défini en planimétrie (généralement l?altitude aux gouttières) et non de l?altitude maximum absolue.
range: float
domain: Class
  union of: Bâti indifferencié
  union of: Bâti industriel
  union of: Bâti remarquable
  union of: Construction linéaire
  union of: Construction ponctuelle
  union of: Construction surfacique
  union of: Réservoir

Z minimal
type: DatatypeProperty
comment: Altitude minimale d?un objet linéaire ou surfacique. Cette information est issue de la saisie photogrammétrique et concerne des objets dont les points initiaux et finaux ne sont pas caractéristiques de l?altitude de l?objet (objets surfaciques, objets linéaires isolés). Pour des objets surfaciques comme les bâtiments ou les réservoirs, il s?agit de l?altitude minimum du pourtour tel qu?il est défini en planimétrie (généralement l?altitude aux gouttières) et non de l?altitude minimum absolue.
range: float
domain: Class
  union of: Bâti indifferencié
  union of: Bâti industriel
  union of: Bâti remarquable
  union of: Construction linéaire
  union of: Construction ponctuelle
  union of: Construction surfacique
  union of: Réservoir

Z moyen
type: DatatypeProperty
comment: Altitude moyenne des points composants la géométrie de l?objet telle qu?il a été saisi à l?origine lorsqu?il est issu d?une saisie photogrammétrique.
range: float
domain: Class
  union of: Piste aérodrome
  union of: Surface route
  union of: Terrain sport

Administratif
type: Class
subclass of: Pai administratif militaire
subclass of: Surface activité
comment: Bâtiment ou zone à caractère public ou administratif, qui n?est ni défini par une autre classe de PAI, ni par une autre valeur d?attribut NATURE de la présente classe (administratif ou militaire) : UNESCO, Parlement Européen, ministère, direction ministérielle, Assemblée nationale, Sénat, cité administrative, poste de douane, capitainerie, salle de spectacle,etc. En général les établissements et les sites retenus ont une importance ou une notoriété d?ordre national ou régional ou une surface au sol d?au moins 1000 m2 environ.

Aire de repos
type: Class
subclass of: Pai transport
subclass of: Toponyme communication
comment: Espace aménagé (présence d?un point d?eau obligatoire) à l ?écart des chaussées, notamment des autoroutes, pour permettre aux usagers de s?arrêter et de se reposer.Emprise de l?aire. Les contours de la surface ne s?appuient jamais sur des sur des tronçons de route qui représentent l?axe des chaussées.

Aire de service
type: Class
subclass of: Pai transport
subclass of: Toponyme communication
comment: Espace aménagé à l?écart des chaussées, notamment des autoroutes, pour permettre aux usagers de se ravitailler en carburant. Emprise de l?aire. Les contours de la surface ne s?appuient jamais sur des tronçons de route (qui représentent l?axe des chaussées).

Amer
type: Class
subclass of: Pai hydrographie
comment: Point de repère visible de la mer : amer, bouée, balise, phare, feu, tourelle.

Antenne
type: Class
subclass of: Construction ponctuelle
comment: Construction destinée à la réception ou à l'émission d'ondes électromagnétiques : antenne, pylône de télécommunication.

Aquaculture
type: Class
subclass of: Pai industriel et commercial
comment: Site aménagé pour l?élevage piscicole ou la culture d?espèces animales marines (coques, coquilles Saint-Jacques, huîtres, moules, palourdes,?) : bouchot, parc à huîtres, zone conchylicole, zone mytilicole, zone ostréicole. Toutes les zones de plus de 3 ha possédant des installations fixes de pêche et délimitées par des alignements de pieux, les parcs à huîtres, les bassins. Les installations de pêche au carrelet sont exclues.

Arbre
type: Class
subclass of: Pai espace naturel
subclass of: Toponyme divers
comment: Arbre nommé isolé, arbre remarquable.

Arc de triomphe
type: Class
subclass of: Bâti remarquable
comment: Portique monumental : arc de triomphe, porte de ville.

Arrondissement
type: Class
comment: Arrondissement municipal : subdivision administrative de certaines communes. Les arrondissements municipaux sont gérés par l?INSEE comme des communes.

Arène
type: Class
subclass of: Bâti remarquable
comment: Vaste édifice à gradins, de forme en partie ou totalement ronde ou elliptique : amphithéâtre, arène, théâtre antique, théâtre de plein air.

Autoroute
type: Class
subclass of: Route
subclass of: Route nommée
subclass of: Route primaire
subclass of: Route secondaire
comment: Les autoroutes sont des routes sans croisement, accessibles seulement en des points aménagés à cet effet et réservées aux véhicules à propulsion mécanique (Article L122-1 du code de la voirie routière).

Aérodrome militaire
type: Class
subclass of: Pai transport
comment: Tout terrain ou plan d'eau réservés à l?armée spécialement aménagé pour l'atterrissage, le décollage et les manoeuvres des aéronefs y compris les installations annexes qu'il peut comporter pour les besoins du trafic et le service des aéronefs : aérodrome militaire, héliport militaire.

Aérodrome non militaire
type: Class
subclass of: Pai transport
comment: Tout terrain ou plan d'eau spécialement aménagé pour l'atterrissage, le décollage et les manoeuvres des aéronefs y compris les installations annexes qu'il peut comporter pour les besoins du trafic et le service des aéronefs : altiport, aérodrome non militaire, héliport. Ne sont pas pris en compte les aéro-clubs, les terrains de vol à voile, les pistes d?ULM.

Aérogare
type: Class
subclass of: Bâti remarquable
comment: Ensemble des bâtiments d'un aéroport réservés aux voyageurs et aux marchandises.

Aéroport international
type: Class
subclass of: Pai transport
subclass of: Toponyme divers
comment: Aérodrome de statut international sur lequel ont été prévues des installations en vue de l'abri, de l'entretien ou de la répartition des aéronefs, ainsi que pour la réception, l'embarquement et le débarquement des passagers, le chargement et le déchargement des marchandises.

Aéroport militaire
type: Class
subclass of: Toponyme divers

Aéroport non militaire
type: Class
subclass of: Toponyme divers

Aéroport quelconque
type: Class
subclass of: Pai transport
subclass of: Toponyme divers
comment: Aérodrome sur lequel ont été prévues des installations en vue de l'abri, de l'entretien ou de la répartition des aéronefs, ainsi que pour la réception, l'embarquement et le débarquement des passagers, le chargement et le déchargement des marchandises.

Bac auto
type: Class
subclass of: Route
subclass of: Route nommée
subclass of: Route primaire
subclass of: Route secondaire
comment: Trajets du bateau servant à passer des véhicules d?une rive à l?autre d?un cours d?eau ou d?un bras de mer.

Bac piéton
type: Class
subclass of: Route
subclass of: Route nommée
subclass of: Route primaire
subclass of: Route secondaire
comment: Trajets du bateau servant à passer des piétons d?une rive à l?autre d?un cours d?eau ou d?un bras de mer.

Baie
type: Class
subclass of: Pai hydrographie
comment: Espace marin pénétrant entre les terres : anse, baie, calanque, crique, golfe.

Barrage
type: Class
subclass of: Construction linéaire
subclass of: Construction surfacique
subclass of: Lieu dit non habité
subclass of: Pai transport
comment: Obstacle artificiel placé en travers d?un cours d?eau : barrage, écluse, vanne.

Bassin de natation
type: Class
subclass of: Terrain sport
comment: Bassin de natation d?une piscine découverte : bassin de natation, piscine (découverte).

Bâti indifferencié
type: Class
comment: Bâtiment de plus de 20 m2, ne possédant pas de fonction particulière pouvant être décrit dans les autres classes de bâtiments surfaciques : bâtiments d?habitation, d?enseignement...

Bâti industriel
type: Class
comment: Bâtiment de plus de 20 m2 à caractère industriel, commercial ou agricole.

Bâti remarquable
type: Class
comment: Bâtiment de plus de 20 m2 possédant une fonction, contrairement aux bâtiments indifférenciés, et dont la fonction est autre qu?industrielle (ces derniers sont regroupés dans la classe BATI_INDUSTRIEL). Il s?agit des bâtiments administratifs, religieux, sportifs, et relatifs au transport.

Blockhaus
type: Class
subclass of: Bâti remarquable
comment: Ouvrage militaire : blockhaus, casemate, fort, ouvrage fortifié.

Bois
type: Class
subclass of: Pai espace naturel
subclass of: Toponyme divers
comment: Bois ou forêt.

Borne
type: Class
subclass of: Pai administratif militaire
comment: Borne nommée : borne frontière, point de triangulation, point frontière.

Bretelle
type: Class
subclass of: Route
subclass of: Route nommée
subclass of: Route primaire
subclass of: Route secondaire
comment: Bretelles de liaison (ou d?échangeur) ou voies d?accès à une Aire de Service ou de Repos.

Bureau de poste
type: Class
subclass of: Pai administratif militaire
comment: Bureau de poste ouvert au public : Bureau de poste, hôtel des postes. Seuls les bureaux de poste ouverts en permanence sont inclus. En général, dans les agglomérations, seules les postes centrales sont incluses.

Bâtiment agricole
type: Class
subclass of: Bâti industriel
comment: Bâtiment réservé à des activités agricoles : bâtiment d'élevage industriel, hangar agricole (grand), minoterie.

Bâtiment commercial
type: Class
subclass of: Bâti industriel
comment: Bâtiment de grande surface réservé à des activités commerciales : centre commercial, hypermarché, magasin (grand, isolé), parc des expositions (bâtiment).

Bâtiment industriel
type: Class
subclass of: Bâti industriel
comment: Bâtiment réservé à des activités industrielles : abattoir, atelier (grand), auvent de quai de gare, bâtiment industriel (grand), centrale électrique (bâtiment), construction technique, entrepôt, hangar industriel (grand), scierie, usine.

Bâtiment religieux divers
type: Class
subclass of: Bâti remarquable
comment: Bâtiment réservé à l?exercice d?un culte religieux, autre qu?une chapelle ou qu?une église (voir ces valeurs) : mosquée, synagogue, temple.

Bâtiment sportif
type: Class
subclass of: Bâti remarquable
comment: Bâtiment réservé à la pratique sportive : gymnase, piscine couverte, salle de sport, tennis couvert.

Camping
type: Class
subclass of: Pai culture loisirs
subclass of: Toponyme divers
comment: Emplacement aménagé pour la pratique du camping d?une superficie de plus de 2 ha.

Canal
type: Class
subclass of: Pai hydrographie
comment: Cours d?eau artificiel : ancien canal, bief, canal, fossé, rigole.

Canton
type: Class
subclass of: Chef lieu

Cap
type: Class
subclass of: Pai orographie
comment: Prédominance dans le contour d?une côte : cap, pointe, promontoire.

Capitale d''état
type: Class
subclass of: Chef lieu

Carrefour
type: Class
subclass of: Pai transport
subclass of: Surface route
subclass of: Toponyme communication
comment: Noeud du réseau routier : carrefour routier, échangeur, rond-point.

Carrière
type: Class
subclass of: Pai industriel et commercial
comment: Lieu d?où l?on extrait à ciel ouvert des matériaux de construction (pierre, roche) : carrière, sablière, ballastière, gravière. Toutes les carrières de plus de 3 ha en exploitation sont incluses. La définition de l?enceinte s?appuie sur les fronts de taille (voir aussi la classe LIGNE_OROGRAPHIQUE) et sur la zone d?exploitation visible sur les photographies aériennes.

Cascade
type: Class
subclass of: Pai hydrographie
comment: Cascade, chute d?eau.

Casemate
type: Class
subclass of: Bâti remarquable
comment: Ouvrage militaire : blockhaus, casemate, fort, ouvrage fortifié.

Caserne de pompiers
type: Class
subclass of: Pai administratif militaire
comment: Bâtiment ayant ou non un bureau ou une permanence et qui est entièrement concerné par l'activité du corps des Sapeurs-Pompiers.

Centrale électrique
type: Class
subclass of: Pai industriel et commercial
subclass of: Toponyme divers
comment: Usine où l?on produit de l?énergie électrique : centrale hydroélectrique, centrale thermique, centrale nucléaire. Les centrales électriques souterraines sont exclues.

Chapelle
type: Class
subclass of: Bâti remarquable
comment: Petit édifice religieux catholique de forme caractéristique

Chef lieu
type: Class
comment: Toponyme de la zone d?habitat dans laquelle se trouve la mairie de la commune. Dans certains cas, le chef-lieu n?est pas dans la commune.

Chemin
type: Class
subclass of: Pai transport
subclass of: Route
subclass of: Route nommée
subclass of: Route primaire
subclass of: Route secondaire
subclass of: Toponyme communication
comment: Voie de communication non routière : allée, chemin, laie forestière, sentier.

Cheminée
type: Class
subclass of: Construction ponctuelle
comment: Construction destinée à l'émission de fumées ou de gaz.

Château
type: Class
subclass of: Bâti remarquable
subclass of: Lieu dit habité
subclass of: Pai zone habitation
comment: Château ou tour. Le lieu-dit, toujours nommé, peut ne pas être habité ou ne plus être habité mais n?est pas totalement en ruines.

Château d''eau
type: Class
subclass of: Réservoir
comment: Réservoir d?eau construit en hauteur pour surélever le niveau de l?eau par rapport aux constructions. Contour extérieur du château d?eau (circonférence maximum), à l?altitude de ce contour (altitude de l?arête supérieure en cas de face verticale).

Cimetière
type: Class
comment: Lieu où l?on enterre les morts. Cimetière communal, islamique, israélite, ou militaire.

Cirque
type: Class
subclass of: Pai orographie
comment: Dépression semi-circulaire, à bords raides.

Col
type: Class
subclass of: Pai orographie
comment: Point de passage imposé par la configuration du relief : col, passage.

Commune
type: Class
subclass of: Chef lieu
comment: Plus petite subdivision du territoire, administrée par un maire, des adjoints et un conseil municipal.

Construction
type: Class
subclass of: Pai culture loisirs
subclass of: Toponyme divers
comment: Construction nommée habitée ou associée à un groupe d?habitations : construction diverse, pigeonnier, moulin à vent.

Construction légère
type: Class
comment: Structure légère non attachée au sol par l?intermédiaire de fondations ou bâtiment quelconque ouvert sur au moins un côté.

Construction linéaire
type: Class
comment: Construction dont la forme générale est linéaire. Exemples : barrage, mur anti-bruit, ruines, etc.

Construction ponctuelle
type: Class
comment: Construction de faible emprise et de grande hauteur de plus de 50 m de haut et de moins de 20 m2.

Construction surfacique
type: Class
comment: Ouvrage de grande surface lié au franchissement d?un obstacle par une voie de communication, ou à l?aménagement d?une rivière ou d?un canal.

Croix
type: Class
subclass of: Lieu dit non habité
subclass of: Pai religieux
comment: Monument religieux : croix, calvaire, vierge, statue religieuse.

Crête
type: Class
subclass of: Pai orographie
comment: Ligne de partage des eaux : crête, arête, ligne de faîte.

Culte catholique
type: Class
subclass of: Pai religieux
comment: Bâtiment réservé à l?exercice du culte catholique ou orthodoxe : église, cathédrale, basilique, chapelle, abbaye, oratoire.

Culte divers
type: Class
subclass of: Pai religieux
comment: Bâtiment réservé à l?exercice d?un culte religieux autre que chrétien, islamique ou israélite : temple bouddhiste, temple hindouiste.

Culte islamique
type: Class
subclass of: Pai religieux
comment: Bâtiment réservé à l?exercice du culte islamique : mosquée.

Culte israélite
type: Class
subclass of: Pai religieux
comment: Bâtiment réservé à l?exercice du culte israélite : synagogue.

Culte protestant
type: Class
subclass of: Pai religieux
comment: Bâtiment réservé à l?exercice du culte protestant : temple (protestant), église réformée.

Culture et loisirs
type: Class
subclass of: Surface activité
comment: Établissement ou lieu spécialement aménagé pour une activité culturelle ou de loisirs : camping, maison du parc, musée, parc de loisirs, parc zoologique, village de vacances.

Dalle de protection
type: Class
subclass of: Construction surfacique
comment: Dalle (ou auvent) horizontale protégeant une voie de communication des chutes de pierres, des coulées de neige, ou protégeant le voisinage du bruit.

Digue
type: Class
subclass of: Lieu dit non habité
subclass of: Pai culture loisirs
comment: Digue, môle, jetée.

Divers commercial
type: Class
subclass of: Pai industriel et commercial
comment: Bâtiment ou zone à caractère commercial : hypermarché, grand magasin, centre commercial, zone à caractère commercial. Au moins tous les sites incluant un « grand magasin », un hypermarché, ou une zone d?activité commerciale d?au moins 5 ha. Les hypermarchés isolés ayant une surface de vente de plus de 4000m2 sont inclus. (voir également la valeur d?attribut « Marché » ci-dessous).

Divers industriel
type: Class
subclass of: Pai industriel et commercial
comment: Organisme ou entreprise à caractère industriel non distingué de façon spécifique : centre de recherche, dépôt, coopérative (vinicole, céréalière?), champignonnière, élevage avicole, haras, abattoir, déchèterie. Tous les sites d?importance ou de notoriété nationale ou régionale, confirmée par un toponyme, et de surface supérieure à 3 ha sont retenus (le toponyme n?est pas nécessairement retenu).

Divers public
type: Class
subclass of: Pai administratif militaire
comment: Bâtiment ou zone à caractère public ou administratif, qui n?est ni défini par une autre classe de PAI, ni par une autre valeur d?attribut NATURE de la présente classe (administratif ou militaire) : UNESCO, Parlement Européen, ministère, direction ministérielle, Assemblée nationale, Sénat, cité administrative, poste de douane, capitainerie, salle de spectacle,etc. En général les établissements et les sites retenus ont une importance ou une notoriété d?ordre national ou régional ou une surface au sol d?au moins 1000 m2 environ.

Dolmen
type: Class
subclass of: Lieu dit non habité
subclass of: Pai culture loisirs
comment: Monument mégalithique formé d?une grande pierre plate posée sur d?autres pierres dressées verticalement. Les allées couvertes sont incluses.

Donjon
type: Class
subclass of: Bâti remarquable
comment: Bâtiment remarquable dans le Paysage par sa forme élevée : donjon, moulin à vent, tour, tour de contrôle.

Dune
type: Class
subclass of: Pai orographie
comment: Monticule de sable sur les bords de la mer.

Départementale
type: Class
subclass of: Route
subclass of: Route nommée
subclass of: Route primaire
subclass of: Route secondaire
comment: Voie qui fait partie du domaine public routier départemental.

Dépression
type: Class
subclass of: Pai orographie
comment: Dépression naturelle du sol : cuvette, bassin fermé, dépression, doline.

Echangeur
type: Class
subclass of: Pai transport
subclass of: Toponyme communication
comment: Noeud du réseau routier à chaussées séparées. Echangeur autoroutier portant un nom.

Ecluse
type: Class
subclass of: Construction surfacique
comment: Ouvrage hydraulique formé essentiellement de portes munies de vannes destiné à retenir ou à lâcher l?eau selon les besoins : ascenseur à bateaux, cale sèche, écluse, radoub.

Eglise
type: Class
subclass of: Bâti remarquable
comment: Edifice religieux catholique de forme caractéristique : basilique, cathédrale, église.

Embouchure
type: Class
subclass of: Pai hydrographie
comment: Embouchure d?un fleuve : delta, embouchure, estuaire.

Enseignement
type: Class
subclass of: Surface activité
comment: Etablissement d?enseignement : enseignement primaire, enseignement secondaire, enseignement supérieur. Tous les établissements d?enseignement publics, confessionnels ou privés ayant un contrat simple ou d?association avec l?Etat sont inclus. Les crèches, les cours du soir, les cités et les restaurants universitaires sont exclus.

Enseignement primaire
type: Class
subclass of: Pai science enseignement
comment: Établissement consacré à l?enseignement maternel et primaire : école primaire, école maternelle, groupe scolaire, Institut Médico-Pédagogique (I.M.P.). Tous les établissements d?enseignement primaire, publics, confessionnels ou privés, ayant un contrat simple ou d?association avec l?État sont inclus. Les crèches sont exclues.

Enseignement secondaire
type: Class
subclass of: Pai science enseignement
comment: Établissement consacré à l?enseignement secondaire : collège, lycée, Centre d?Aide par le Travail (C.A.T.), Formation Professionnelle des Adultes (F.P.A.), Institut Médico-Professionnel (I.M.Pro.). Tous les établissements d?enseignement secondaire publics, confessionnels ou privés, ayant un contrat simple ou d?association avec l?État sont inclus.

Enseignement supérieur
type: Class
subclass of: Pai gestion des eaux
subclass of: Pai science enseignement
subclass of: Toponyme divers
comment: Établissement consacré à l?enseignement supérieur : faculté, centre universitaire, institut, grande école,etc. Tous les établissements d?enseignement supérieur publics, confessionnels ou privés, ayant un contrat simple ou d?association avec l?État sont inclus. Les cours du soir, les cités et les restaurants universitaires sont exclus.

Eolienne
type: Class
subclass of: Construction ponctuelle
comment: Une éolienne est un dispositif permettant d'utiliser l'énergie éolienne pour produire de l'énergie mécanique ou bien de l'électricité. Seules les éoliennes récentes, destinées à produire de l?électricité, sont retenues.

Escalier
type: Class
subclass of: Chemin
subclass of: Construction surfacique
subclass of: Route
subclass of: Route nommée
subclass of: Route primaire
subclass of: Route secondaire
comment: Escalier monumental uniquement (contours de l?escalier).

Escarpement
type: Class
subclass of: Pai orographie
comment: Escarpement du relief : barre rocheuse, escarpement rocheux, face abrupte, falaise.

Espace maritime
type: Class
subclass of: Pai hydrographie
comment: Espace maritime, mer, océan, passe.

Espace public
type: Class
subclass of: Lieu dit non habité
subclass of: Pai culture loisirs
comment: Large espace découvert urbain désigné par un toponyme où aboutissent plusieurs rues, fermé à la circulation automobile, constituant un lieu remarquable : place, square, jardin, parc, parc communal, parc intercommunal, parc départemental, parc interdépartemental. Seuls les espaces publics possédant un toponyme sont retenus. Les parcs à vocation commerciale sont exclus (voir la valeur « Parc de loisirs » ci-dessous), de même que les parcs naturels (réserves, parcs nationaux, parcs naturels régionaux) qui sont traités en PAI_ESPACE_NATUREL.

Etablissement hospitalier
type: Class
subclass of: Pai sante
subclass of: Toponyme divers
comment: Établissement public ou privé qui reçoit ou traite pendant un temps limité les malades, les blessés et les femmes en couches : hôpital, sanatorium, hospice, centre de soins, dispensaire, hôpital de jour, hôpital psychiatrique, etc. Tous les établissements assurant les soins et l?hébergement ou les soins seulement sont inclus. Les maisons de retraite ne possédant pas de centre de soins sont exclues.

Etablissement thermal
type: Class
subclass of: Pai sante
subclass of: Toponyme divers
comment: Établissement où l?on utilise les eaux médicinales (eaux minérales, chaudes ou non) : établissement thermal, centre de thalassothérapie. Seuls sont inclus les établissements agréés par la Sécurité Sociale.

Fort
type: Class
subclass of: Bâti remarquable
comment: Ouvrage militaire : blockhaus, casemate, fort, ouvrage fortifié.

Gare
type: Class
subclass of: Bâti remarquable
comment: Bâtiment servant à l'embarquement et au débarquement des voyageurs en train.

Gare fret uniquement
type: Class
subclass of: Pai transport
comment: Établissement ferroviaire assurant un service commercial de marchandises : gare de fret, point de desserte. Le fret aérien ou maritime est exclu.

Gare routière
type: Class
subclass of: Pai transport
comment: Ensemble des installations destinées à l?embarquement et au débarquement de voyageurs en car ou en bus en un point déterminé. Ne sont pas retenues les gares routières des bus de ville, des bus scolaires, de la RATP et les dépôts de bus.

Gare voyageurs et fret
type: Class
subclass of: Pai transport
comment: Établissement ferroviaire assurant un service commercial de voyageurs et de marchandises.(Uniquement le bâtiment principal ouvert au public.)

Gare voyageurs uniquement
type: Class
subclass of: Pai transport
comment: Établissement ferroviaire ou de transport par câble assurant avec ou sans personnel un service commercial de voyageurs : gare, station, point d?arrêt, station réseau ferré urbain, gare téléphérique. Toutes les gares et arrêts ferroviaires en service sont inclus.

Gendarmerie
type: Class
subclass of: Pai administratif militaire
comment: Caserne où les gendarmes sont logés ; bureaux où ils remplissent leurs fonctions administratives : gendarmerie, gendarmerie d?autoroute. Définition de l?emprise du site : surface de l?ensemble de la caserne, généralement délimitée par une clôture et incluant logements et bureaux.

Gestion des eaux
type: Class
subclass of: Surface activité
comment: Construction ou site liés à l?approvisionnement, au traitement de l?eau pour différents besoins (agricole, industriel, consommation) ou à l?épuration des eaux usées avant rejet dans la nature : station de pompage, usine de traitement des eaux.

Glacier
type: Class
subclass of: Pai hydrographie
comment: Nom d?un glacier ou d?un détail relatif à un glacier : crevasse, glacier, moraine, névé, sérac.

Golf
type: Class
subclass of: Pai sport
subclass of: Toponyme divers
comment: Terrain ouvert au public et consacré à la pratique du golf. Les terrains de moins de 9 trous et les minigolfs sont exclus.

Gorge
type: Class
subclass of: Pai orographie
comment: Vallée étroite et encaissée : canyon, cluse, défilé, gorge.

Grange
type: Class
subclass of: Lieu dit habité
subclass of: Pai zone habitation
comment: Construction légère : abri, baraquement, cabane, grange, hangar.

Grotte
type: Class
subclass of: Pai orographie
comment: Grotte naturelle ou excavation : aven, cave, gouffre, grotte.

Gué
type: Class
comment: Passage naturel ou aménagé permettant aux véhicules de traverser un cours d?eau sans le recours d?un pont ou d?un bateau.

Habitation troglodytique
type: Class
subclass of: Lieu dit non habité
subclass of: Pai culture loisirs
comment: Excavation naturelle ou creusée dans le roc (caverne, grotte), habitée ou anciennement habitée.

Haras national
type: Class
subclass of: Pai industriel et commercial
subclass of: Toponyme divers
comment: Lieu ou établissement destiné à la reproduction de l?espèce chevaline, à l?amélioration des races de chevaux par la sélection des étalons. Tous les haras nationaux sont inclus. L?enceinte comprend l?ensemble des installations (manège, écuries, piste d?entraînement,?).

Hippodrome
type: Class
subclass of: Pai sport
subclass of: Toponyme divers
comment: Lieu ouvert au public et consacré aux courses de chevaux. Seuls les hippodromes possédant des aménagements conséquents (tribunes, bâtiments spécifiques) sont inclus.

Hôpital
type: Class
subclass of: Pai sante
subclass of: Toponyme divers
comment: Établissement public ou privé, où sont effectués tous les soins médicaux et chirurgicaux lourds et/ou de longue durée, ainsi que les accouchements : hôpital, CHU, hôpital militaire, clinique.

Hôtel de département
type: Class
subclass of: Pai administratif militaire
comment: Bâtiment où siège le conseil général. Seul le bâtiment principal est inclus. Les annexes ne le sont pas, sauf éventuellement une annexe située dans une autre agglomération lorsqu?elle a une fonction proche de celle du siège.

Hôtel de police
type: Class
subclass of: Pai administratif militaire
comment: Établissement occupé par un commissaire de police (officier de police judiciaire chargé de faire observer les règlements de police et de veiller au maintien de la paix publique) : hôtel de police nationale, commissariat, CRS d?autoroute, de port ou d?aéroport. Les bâtiments hébergeant uniquement la police municipale sont exclus. Les casernes de CRS et de gendarmes mobiles prennent la valeur « enceinte militaire » et les gendarmeries la valeur « gendarmerie ».

Hôtel de région
type: Class
subclass of: Pai administratif militaire
comment: Bâtiment où siège le conseil régional. Seul le bâtiment principal est inclus. Les annexes ne le sont pas, sauf éventuellement une annexe située dans une autre agglomération lorsqu?elle a une fonction proche de celle du siège.

Hôtel des postes
type: Class
subclass of: Pai administratif militaire
comment: Bureau de poste ouvert au public : Bureau de poste, hôtel des postes. Seuls les bureaux de poste ouverts en permanence sont inclus. En général, dans les agglomérations, seules les postes centrales sont incluses.

Île
type: Class
subclass of: Pai orographie
comment: Ile, îlot ou presqu?île.

Industriel et commercial
type: Class
subclass of: Surface activité
comment: Bâtiment, site ou zone à caractère industriel ou commercial : aquaculture, carrière, centrale électrique, divers commercial, divers industriel, haras national, marais salants, marché, mine, usine. Les sites ayant perdu leur fonction industrielle ou commerciale sont exclus (ancienne usine, ancienne carrière).

Infrastructure routière
type: Class
subclass of: Pai transport
subclass of: Toponyme communication
comment: Élément du réseau routier ne figurant ni en attribut d?un objet « tronçon de route » ni avec la valeur d?attribut « carrefour » : route, aire de péage, aire de repos.

Isthme
type: Class
subclass of: Pai orographie
comment: Bande de terre étroite entre deux mers, réunissant deux terres : cordon littoral, isthme.

Lac
type: Class
subclass of: Pai hydrographie
comment: Étendue d?eau terrestre : bassin, étang, lac, mare.

Lieu-dit habité
type: Class
subclass of: Lieu dit habité
subclass of: Pai zone habitation
comment: Groupe d?habitations nommé situé en dehors du chef-lieu de commune : hameau, habitation isolée, ancien chef-lieu de commune.

Lieu-dit non habité
type: Class
subclass of: Lieu dit non habité
subclass of: Pai espace naturel
comment: Lieu-dit quelconque, dont le nom est généralement attaché à des terres : lieu-dit non habité, plantation, espace cultivé.

Lieu dit habité
type: Class
comment: Lieu-dit habité caractérisé par un nom.

Lieu dit non habité
type: Class
comment: Lieu-dit non habité caractérisé par un nom.

Mairie
type: Class
subclass of: Bâti remarquable
subclass of: Pai administratif militaire
comment: Bâtiment où se trouvent le bureau du maire, les services de l?administration municipale et où siège normalement le conseil municipal : mairie, mairie annexe, hôtel de ville. Les mairies annexes sont incluses (fréquentes dans les grandes villes ou dans les anciens chefs-lieux de commune ayant fusionné, elles offrent des services similaires aux mairies principales). Les annexes de la mairie (services techniques,?) sont exclues. En général le bâtiment saisi est celui de l?accueil du public.

Maison du parc
type: Class
subclass of: Pai culture loisirs
subclass of: Toponyme divers
comment: Bâtiment ouvert au public et géré par un Parc National ou Régional.

Maison forestière
type: Class
subclass of: Pai administratif militaire
subclass of: Toponyme divers
comment: Maison gérée par l?office national des forêts. Les maisons de garde occupées par au moins un agent de l?ONF sont incluses. Les bureaux de l?ONF, les domiciles d?agents servant aussi de bureau, sont exclus lorsqu?ils ne sont pas situés dans une maison forestière.

Marais
type: Class
subclass of: Pai hydrographie
comment: Zone humide : marais, marécage, saline.

Marais salants
type: Class
subclass of: Lieu dit non habité
subclass of: Pai industriel et commercial
comment: Zone constituée de bassins creusés à proximité des côtes pour extraire le sel de l?eau de mer par évaporation. Les zones de marais salants de moins de 3 ha sont exclues. Les anciens marais salants qui ne sont plus en activité sont exclus.

Marché
type: Class
subclass of: Pai industriel et commercial
comment: Tout ensemble construit dont la finalité est la commercialisation de gros ou de détail de denrées alimentaires : marché couvert, marché d?intérêt national, marché d?intérêt régional, halle, foire, zone d?exposition à caractère permanent, criée couverte.

Menhir
type: Class
subclass of: Pai culture loisirs
subclass of: Toponyme divers
comment: Pierre allongée, dressée verticalement. Les alignements en cromlech sont inclus.

Militaire
type: Class
subclass of: Cimetière

Mine
type: Class
subclass of: Lieu dit non habité
subclass of: Pai industriel et commercial
comment: Lieu d?où l?on extrait des minerais : mine de houille, mine de lignite, crassier, entrée de mine, terril. Les mines à ciel ouvert de plus de 10 ha sont incluses. Les mines souterraines sont exclues.

Montagne
type: Class
subclass of: Pai orographie
comment: Désigne une montagne ou un massif de manière globale et non un sommet en particulier (voir sommet).

Monument
type: Class
subclass of: Bâti remarquable
subclass of: Pai culture loisirs
subclass of: Toponyme divers
comment: Monument sans caractère religieux particulier : monument, statue, stèle.

Moulin
type: Class
subclass of: Bâti remarquable
subclass of: Lieu dit habité
subclass of: Pai zone habitation
comment: Moulin ou ancien moulin à eau.

Mur anti-bruit
type: Class
subclass of: Construction linéaire
comment: Mur destiné à protéger les riverains d?une voie de communication du bruit qu?elle engendre.

Musée
type: Class
subclass of: Pai culture loisirs
subclass of: Toponyme divers
comment: Etablissement ouvert au public exposant une grande collection d'objets, de documents, etc., relatifs aux arts et aux sciences et pouvant servir a leur histoire. Sont inclus : tous les musees controles ou supervises par le ministere de la Culture (musees nationaux, classes, controles,¡K). les musees relevant de certains ministeres techniques ou de l¡¦assistance publique (musee de l¡¦armee, de la marine). les musees prives ou associatifs ayant une grande notoriete. les ecomusees.

Nationale
type: Class
subclass of: Route
subclass of: Route nommée
subclass of: Route primaire
subclass of: Route secondaire
comment: Route nationale (voies du domaine public routier national autres que les autoroutes précédemment définies).

Orthodoxe
type: Class
subclass of: Pai religieux
comment: Bâtiment réservé à l?exercice du culte catholique ou orthodoxe : église, cathédrale, basilique, chapelle, abbaye, oratoire.

Ouvrage militaire
type: Class
subclass of: Lieu dit non habité
subclass of: Pai administratif militaire
comment: Ouvrages et installations militaires.

Pai administratif militaire
type: Class
comment: Désignation d?un établissement, site ou zone ayant un caractère public ou administratif ou militaire.

Pai culture loisirs
type: Class
comment: Désignation d?un établissement ou lieu spécialement aménagé pour une activité culturelle, touristique ou de loisirs.

Pai espace naturel
type: Class
comment: Désignation d?un lieu-dit non habité dont le nom se rapporte ni à un détail orographique ni à un détail hydrographique.

Pai gestion des eaux
type: Class
comment: Désignation d?une construction ou site liés à l?approvisionnement, au traitement de l?eau pour différents besoins (agricole, industriel, consommation) ou à l?épuration des eaux usées avant rejet dans la nature.

Pai hydrographie
type: Class
comment: Désignation se rapportant à un détail hydrographique.

Pai industriel et commercial
type: Class
comment: Désignation d?un bâtiment, site ou zone à caractère industriel ou commercial.

Pai orographie
type: Class
comment: Désignation d?un détail du relief.

Pai religieux
type: Class
comment: Désignation d?un bâtiment réservé à la pratique d?une religion.

Pai sante
type: Class
comment: Désignation d?un établissement thermal ou de type hospitalier.

Pai science enseignement
type: Class
comment: Désignation d?un établissement d?enseignement ou de recherche.

Pai sport
type: Class
comment: Désignation d?un établissement ou lieu spécialement aménagé pour la pratique d?une ou de plusieurs activités sportives.

Pai transport
type: Class
comment: Désignation d?un bâtiment ou site lié à une activité de transport routier, ferré ou aérien.

Pai zone habitation
type: Class
comment: Désignation d?un lieu-dit habité caractérisé par un nom.

Palais de justice
type: Class
subclass of: Pai administratif militaire
comment: Bâtiment où l?on rend la justice : palais de justice, tribunal. Seule la justice pénale est traitée. Les tribunaux administratifs sont exclus.

Parc
type: Class
subclass of: Pai espace naturel
subclass of: Toponyme divers
comment: Espace réglementé, généralement libre d?accès pour le public et où la nature fait l?objet d?une protection spéciale : jardin, parc municipal, parc intercommunal, parc départemental, parc interdépartemental, parc naturel régional, parc national, réserve naturelle, parc marin. Les parcs à vocation commerciale ne sont pas pris en compte dans cet attribut.

Parc de loisirs
type: Class
subclass of: Pai culture loisirs
subclass of: Toponyme divers
comment: Parc à caractère commercial spécialement aménagé pour les loisirs : centre permanent de jeux, parc d?attraction, parc de détente, centre de loisirs. Seuls les parcs dont la superficie excède 10 ha et dotés d?équipements conséquents sont inclus. Les parcs publics (jardins, parcs communaux, départementaux?) sont exclus (voir la valeur « espace public » ci-dessus).

Parc des expositions
type: Class
subclass of: Pai culture loisirs
subclass of: Toponyme divers
comment: Lieu d?exposition ou de culture : centre culturel, parc des expositions.

Parc zoologique
type: Class
subclass of: Pai culture loisirs
subclass of: Toponyme divers
comment: Parc ouvert au public, où il est possible de voir des animaux sauvages vivant en captivité ou en semi-liberté. Tous les parcs ouverts au public sont inclus.

Pare-feu
type: Class
subclass of: Pai espace naturel
comment: Dispositif destiné à empêcher la propagation d?un incendie (généralement, ouverture pratiquée dans le massif forestier menacé).

Parking
type: Class
subclass of: Pai transport
subclass of: Surface route
subclass of: Toponyme communication
comment: Une aire de stationnement ou parking est une zone aménagée pour le stationnement des véhicules : aire de stationnement, parking, parking souterrain, parking à étages. Tous les parkings publics nommés de plus de 25 places sont inclus qu?ils soient souterrains ou aériens (ex. parkings municipaux), Les parkings de plus de 25 places associés à des services de transport (gares, aéroports) sont retenus même s?ils n?ont pas de nom propre. Les parkings d?aires de repos ou de service ne sont pas retenus (voir les valeur <Aire de repos> et <Aire de service>). Le parkings appartenant à des établissements purement commerciaux (ex. parking de supermarché) sont exclus (pour ces derniers, voir aussi la classe Surface de route). Un Parking est un objet ponctuel situé au centre de l?aire de stationnement, ou à l?entrée pour les parkings souterrains. Il est généralement associé à une surface pour des parkings aériens de plus de 5 ha.

Perte
type: Class
subclass of: Pai hydrographie
comment: Lieu où disparaît, où se perd un cours d?eau, qui réapparaît ensuite, en formant une résurgence, après avoir effectué un trajet souterrain.

Phare
type: Class
subclass of: Construction ponctuelle
comment: Tour élevée portant au sommet un foyer plus ou moins puissant destiné à guider les navires pendant la nuit. C'est le sommet du phare qui est indiqué. Il se superpose généralement à un objet de classe BATI_INDIFFERENCIE.

Pic
type: Class
subclass of: Pai orographie
comment: Sommet pointu d?une montagne : aiguille, pic, piton.

Piscine
type: Class
subclass of: Pai sport
comment: Grand bassin de natation, et ensemble des installations qui l'entourent : piscine couverte, piscine découverte. Toutes les piscines ouvertes au public et ayant un bassin au moins de 25 m ou plus sont incluses. Les piscines des centres de vacances ou des hôtels sont exclues (voir la classe TERRAIN_SPORT).

Piste aérodrome
type: Class
comment: Aire située sur un aérodrome, aménagée afin de servir au roulement des aéronefs, au décollage et à l?atterrissage, en dur ou en herbe.

Piste cyclable
type: Class
subclass of: Chemin
subclass of: Route
subclass of: Route nommée
subclass of: Route primaire
subclass of: Route secondaire
comment: Tronçons de chaussée en site propre, réservée aux cycles et cyclomoteurs. La longueur doit être supérieure à 200m. Les bandes cyclables sont exclues.

Piste de sport
type: Class
subclass of: Terrain sport
comment: Large piste réservée à la course : autodrome (piste), circuit auto-moto (piste), cynodrome (piste), hippodrome (piste), vélodrome (piste).

Piste en dur
type: Class
subclass of: Piste aérodrome

Piste en herbe
type: Class
subclass of: Piste aérodrome

Place
type: Class
subclass of: Surface route
comment: Place ou carrefour revêtu de grande largeur.

Plage
type: Class
subclass of: Pai orographie
comment: Zone littorale marquée par le flux et le reflux des marées : grève, plage.

Plaine
type: Class
subclass of: Pai orographie
comment: Zone de surface terrestre caractérisée par une relative planéité : plaine, plateau.

Point d''eau
type: Class
subclass of: Pai hydrographie
comment: Tout point d?eau naturel ou artificiel : captage, citerne, fontaine, puits, résurgence, source.

Point de vue
type: Class
subclass of: Lieu dit non habité
subclass of: Pai espace naturel
comment: Endroit d?où l?on jouit d?une vue pittoresque : point de vue, table d?orientation, belvédère. Seuls les points de vue aménagés (table d?orientation, bancs,?) sont inclus

Pont
type: Class
subclass of: Construction linéaire
subclass of: Construction surfacique
subclass of: Pai transport
subclass of: Toponyme communication
comment: Ouvrage d'art permettant le franchissement d'une vallée ou d'une voie de communication : pont, passerelle, viaduc, gué, pont mobile.

Port
type: Class
subclass of: Pai transport
subclass of: Toponyme communication
comment: Abri naturel ou artificiel aménagé pour recevoir les navires, pour l'embarquement et le débarquement de leur chargement : port de plaisance, port de pêche, port national, port privé, port international, port militaire.

Poste de police
type: Class
subclass of: Pai administratif militaire
comment: Établissement occupé par un commissaire de police (officier de police judiciaire chargé de faire observer les règlements de police et de veiller au maintien de la paix publique) : hôtel de police nationale, commissariat, CRS d?autoroute, de port ou d?aéroport. Les bâtiments hébergeant uniquement la police municipale sont exclus. Les casernes de CRS et de gendarmes mobiles prennent la valeur « enceinte militaire » et les gendarmeries la valeur « gendarmerie ».

Préfecture
type: Class
subclass of: Bâti remarquable
subclass of: Chef lieu
subclass of: Pai administratif militaire
comment: Établissement qui abrite l'ensemble des services de l'administration préfectorale. Les annexes sont exclues.

Préfecture de région
type: Class
subclass of: Chef lieu
subclass of: Pai administratif militaire
comment: Établissement qui abrite le siège de l?administration civile de la région. Les annexes sont exclues.

Péage
type: Class
subclass of: Bâti remarquable
subclass of: Pai transport
subclass of: Surface route
subclass of: Toponyme communication
comment: Barrière de péage. Toutes les barrières de péage sont représentées, qu?elles soient ou non accompagnées d?un élargissement de la chaussée ou d?un bâtiment : péage d?autoroute, de pont, de route. Si aucun objet de la base n?est associé au péage (ni surface de route ni bâtiment), le point d?activité est saisi sur l?axe de la route au niveau de la barrière de péage. Le péage est modélisé par une surface incluant tous les objets associés à cette fonction : SURFACE_ROUTE BATI_REMARQUABLE ou les deux.

Pêcherie
type: Class
subclass of: Pai hydrographie
comment: Zone d?activité aquacole : bouchot, parc à huîtres, pêcherie.

Quai
type: Class
subclass of: Construction linéaire
comment: Muraille en maçonnerie ou enrochement, élevée le long d?un cours d?eau pour retenir les berges, pour empêcher les débordements. Rivage d?un port aménagé pour l?accostage des bateaux. Ouvrage en maçonnerie s?opposant à l?écoulement des eaux marines ou fluviales.

Quartier
type: Class
subclass of: Lieu dit habité
subclass of: Pai zone habitation
comment: Quartier nommé : cité, faubourg, lotissement.

Quasi-autoroute
type: Class
subclass of: Route
subclass of: Route nommée
subclass of: Route primaire
subclass of: Route secondaire
comment: Routes de même définition que l?autoroute mais non classées officiellement dans cette catégorie. Ce sont des routes à chaussées séparées par un terre-plein central, qui ne possèdent pas de croisement à niveau avec le reste du réseau routier.

Radier
type: Class
comment: Passage naturel ou aménagé permettant aux véhicules de traverser un cours d?eau sans le recours d?un pont ou d?un bateau.

Refuge
type: Class
subclass of: Lieu dit habité
subclass of: Pai culture loisirs
comment: Refuge, refuge gardé, abri de montagne nommé.

Réservoir
type: Class
comment: Réservoir (eau, matières industrielles,?) de plus de 10m de diamètre.

Rivière
type: Class
subclass of: Pai hydrographie
comment: Zone d?activité aquacole : bouchot, parc à huîtres, pêcherie.

Rochers
type: Class
subclass of: Pai orographie
comment: Zone ou détail caractérisé par une nature rocheuse mais non verticale : chaos, éboulis, pierrier, rocher.

Rond-point
type: Class
subclass of: Pai transport
subclass of: Toponyme communication
comment: Rond-point, place de forme circulaire, ovale ou semi-circulaire, ou carrefour giratoire. Un giratoire est formé d'un anneau central qui permet aux usagers de prendre n'importe quelle direction, y compris de faire un demi-tour. Seuls les ronds-points nommés sont retenus.

Route
type: Class
comment: Portion de voie de communication destinée aux automobiles, aux piétons, aux cycles ou aux animaux, homogène pour l'ensemble des attributs et des relations qui la concernent. Le tronçon de route peut être revêtu ou non revêtu (pas de revêtement de surface ou revêtement de surface fortement dégradé). Dans le cas d'un tronçon de route revêtu, on représente uniquement la chaussée, délimitée par les bas-côtés ou les trottoirs.

Route empierrée
type: Class
subclass of: Route
subclass of: Route nommée
subclass of: Route primaire
subclass of: Route secondaire
comment: Routes sommairement revêtues (pas de revêtement de surface ou revêtement très dégradé), mais permettant la circulation de véhicules automobiles de tourisme par tout temps. Toutes les routes empierrées sont incluses.

Route nommée
type: Class
comment: Portion de voie de communication destinée aux automobiles, aux piétons, aux cycles ou aux animaux, homogène pour l'ensemble des attributs et des relations qui la concernent. Le tronçon de route peut être revêtu ou non revêtu (pas de revêtement de surface ou revêtement de surface fortement dégradé). Dans le cas d'un tronçon de route revêtu, on représente uniquement la chaussée, délimitée par les bas-côtés ou les trottoirs.

Route primaire
type: Class
comment: Portion de voie de communication destinée aux automobiles, aux piétons, aux cycles ou aux animaux, homogène pour l'ensemble des attributs et des relations qui la concernent. Cette classe est un sous-ensemble de la classe ROUTE, et comprend uniquement les tronçons de route d?importance 1 ou 2. Cela permet de n?utiliser ou de n?afficher que le réseau dit principal, pour des raisons de faciliter de manipulation ou de lisibilité à l?écran suivant l?échelle.

Route secondaire
type: Class
comment: Portion de voie de communication destinée aux automobiles, aux piétons, aux cycles ou aux animaux, homogène pour l'ensemble des attributs et des relations qui la concernent. Cette classe est un sous-ensemble de la classe ROUTE, et comprend uniquement les tronçons de route d?importance supérieure à 2. Cela permet de n?utiliser ou de n?afficher que le réseau dit secondaire, pour des raisons de faciliter de manipulation ou de lisibilité à l?écran suivant l?échelle.

Route à'1'chaussée
type: Class
subclass of: Route
subclass of: Route nommée
subclass of: Route primaire
subclass of: Route secondaire
comment: Routes comportant 1 chaussée.Toutes les routes goudronnées qui ne sont pas classées en Route à 2 chaussées, Quasi-autoroute ou Autoroute se retrouvent dans cette classe.

Route à'2'chaussées
type: Class
subclass of: Route
subclass of: Route nommée
subclass of: Route primaire
subclass of: Route secondaire
comment: Routes comportant 2 chaussées séparées par un obstacle physique éventuellement ouvert aux carrefours. Elles possèdent donc des croisements à niveau, ce qui leur interdit d'être classées dans la catégorie Autoroute ou Quasi-autoroute.

Ruines
type: Class
subclass of: Construction linéaire
subclass of: Lieu dit habité
subclass of: Pai zone habitation
comment: Bâtiment ou construction en ruines.

Récif
type: Class
subclass of: Pai orographie
comment: Rocher situé en mer ou dans un fleuve, mais dont une partie, faiblement émergée, peut constituer un obstacle ou un repère : brisant, récif, rocher marin.

Réservoir d''eau
type: Class
subclass of: Réservoir
comment: Réservoirs d?eau et châteaux d?eau au sol dans lesquels la réserve d?eau est située au niveau du sol. Le réservoir est souvent semi enterré. Contour extérieur du réservoir tel qu?il apparaît vu d?avion.

Réservoir industriel
type: Class
subclass of: Réservoir
comment: Réservoir de matière première industrielle : gazomètre, réservoir d?hydrocarbure, réservoir de matériaux de construction, réservoir industriel. Tous les réservoirs de plus de 10 m de large sont inclus. Contour extérieur du réservoir tel qu?il apparaît vu d?avion.

Santé
type: Class
subclass of: Surface activité
comment: Établissement thermal ou de type hospitalier : établissement hospitalier, établissement thermal.

Sentier
type: Class
subclass of: Chemin
subclass of: Route
subclass of: Route nommée
subclass of: Route primaire
subclass of: Route secondaire
comment: Chemins étroits ne permettant pas le passage de véhicules. Seuls les principaux sentiers sont inclus. Passerelles supportant une allée, directement reliés au réseau routier. Les passerelles ont une position par rapport au sol supérieure à 0.

Serre
type: Class
subclass of: Bâti industriel
comment: Abri clos à parois translucides destiné à protéger les végétaux du froid : jardinerie, serre. Les serres en arceaux de moins de 20 m de long sont exclues. Les serres situées à moins de 3 m les unes des autres sont modélisées par un seul objet englobant l?ensemble des serres en s?appuyant au maximum sur leurs contours.

Silo
type: Class
subclass of: Bâti industriel
comment: Réservoir, qui chargé par le haut se vide par le bas, et qui sert de dépôt, de magasin, etc. Le silo est exclusivement destiné aux produits agricoles : cuve à vin, silo

Sommet
type: Class
subclass of: Pai orographie
comment: Point haut du relief non caractérisé par un profil abrupt (voir la nature Pic) : colline, mamelon, mont, sommet.

Sous-préfecture
type: Class
subclass of: Bâti remarquable
subclass of: Chef lieu
subclass of: Pai administratif militaire
comment: Établissement qui abrite les services administratifs du sous-préfet. Les annexes sont exclues.

Sport
type: Class
subclass of: Surface activité
comment: Établissement ou lieu spécialement aménagé pour la pratique d?une ou de plusieurs activités sportives : golf, hippodrome, piscine, stade.

Stade
type: Class
subclass of: Pai sport
subclass of: Toponyme divers
comment: Grande enceinte, terrain aménagé pour la pratique des sports, et le plus souvent entouré de gradins, de tribunes : stade, terrain de sports, vélodrome découvert, circuit auto-moto, complexe sportif pluridisciplinaire. Seules les enceintes incluant des aménagements conséquents (piste « construite », tribunes,?) sont incluses. Les terrains d?entraînement incluant seulement 2 ou 3 terrains de football et de petits vestiaires sont exclus (voir aussi la classe TERRAIN_SPORT)

Station de métro
type: Class
subclass of: Pai transport
comment: Station où il est possible d'accéder au réseau du métro. On saisit un seul objet 'Station de métro' même s'il y a plusieurs entrées distinctes, éventuellement plusieurs ponctuels 'Station de métro' pour les correspondances importantes (ex : Bastille) mais un seul ponctuel pour une station de métro qui n?est pas une correspondance.

Station de pompage
type: Class
subclass of: Pai gestion des eaux
comment: Site incluant au moins une construction abritant une installation de captage ou de pompage des eaux : captage, pompage pour besoins agricole ou industriel, pompage pour production eau potable. Toutes les stations de pompage servant à l?alimentation en eau potable d?une collectivité sont incluses.

Surface activité
type: Class
comment: Enceinte d?un équipement public, d?un site ou d?une zone ayant un caractère administratif, culturel, sportif, industriel ou commercial.

Surface route
type: Class
comment: Partie de la chaussée d?une route caractérisée par une largeur exceptionnelle (place, carrefour, péage, parking). Zone à trafic non structuré.

Terrain de tennis
type: Class
subclass of: Terrain sport
comment: Terrain spécialement aménagé pour la pratique du tennis.

Terrain sport
type: Class
comment: Equipememnt sportif de plein air.

Théâtre antique
type: Class
subclass of: Bâti remarquable
comment: Vaste édifice à gradins, de forme en partie ou totalement ronde ou elliptique : amphithéâtre, arène, théâtre antique, théâtre de plein air.

Tombeau
type: Class
subclass of: Lieu dit non habité
subclass of: Pai religieux
comment: Cimetière, tombe ou tombeau nommé : cimetière, tombe, tombeau, ossuaire, funérarium.

Toponyme communication
type: Class
comment: Objet nommé du thème routier.

Toponyme divers
type: Class
comment: Toponyme de nature diverse, désignant un bâtiment administratif, ou bien une école, un détail religieux, un établissement de santé... etc.

Torchère
type: Class
subclass of: Construction ponctuelle
comment: Canalisation verticale par laquelle s'échappent et brûlent les résidus gazeux d'une raffinerie.

Tour
type: Class
subclass of: Bâti remarquable
comment: Bâtiment remarquable dans le Paysage par sa forme élevée : donjon, moulin à vent, tour, tour de contrôle.

Transformateur
type: Class
subclass of: Construction ponctuelle
comment: Bâtiment technique dont la fonction est de transformer un système de courants variables en un ou plusieurs autres systèmes de courants variables de même fréquence, mais d?intensité ou de tension généralement différentes. Seuls les transformateurs de moins de 20m2 environ et de grande hauteur (ancien modèle) sont inclus.

Transport
type: Class
subclass of: Surface activité
comment: Bâtiment ou site lié à une activité de transport routier, ferré ou aérien : aérodrome, aire d?autoroute, gare voyageurs uniquement, gare voyageurs et fret, gare fret uniquement, péage. La surface d?activité avec un PAI de nature péage est superposée à la surface de route de nature péage, aux différences de saisie près.

Tribune
type: Class
subclass of: Bâti remarquable
comment: Tribune de terrain de sport (stade, hippodrome, vélodrome,...).

Tunnel
type: Class
subclass of: Pai transport
subclass of: Toponyme communication
comment: Tunnel.

Téléphérique
type: Class
subclass of: Pai transport
comment: Remonte-pente, télécabine, télésiège, téléphérique, téléski.

Usine
type: Class
subclass of: Pai industriel et commercial
comment: Établissement dominé par une activité industrielle (fabrication d?objets ou de produits, transformation ou conservation de matières premières) : atelier, fabrique, manufacture, mine avec infrastructure bâtie, usine, scierie. Les sites dont la superficie est inférieure à 5 ha sont généralement exclus.

Usine de traitement des eaux
type: Class
subclass of: Pai gestion des eaux
comment: Établissement comprenant des installations destinées à rendre l?eau propre à la consommation (usine de traitement des eaux) ou à épurer des eaux usées avant leur rejet dans la nature (stations d?épuration, de lagunage) : usine de traitement des eaux, station d?épuration, station de lagunage. Les stations d?épuration et de lagunage sont incluses. Les stations traitant l?eau afin de la rendre propre à la consommation sont incluses lorsqu?elles comprennent des installations conséquentes (usines comprenant bassins, filtrages, traitements mécaniques). Sont exclues les stations lorsqu?il s?agit uniquement d?un traitement chimique d?appoint effectué au niveau d?un captage ou d?un réservoir. Les stations de relèvement sont également exclues.

Vallée
type: Class
subclass of: Pai orographie
comment: Espace entre deux ou plusieurs montagnes. Forme définie par la convergence des versants et qui est, ou a été parcourue par un cours d'eau : combe, ravin, val, vallée, vallon, thalweg.

Versant
type: Class
subclass of: Pai orographie
comment: Plan incliné joignant une ligne de crête à un thalweg : coteau, versant.

Vestiges archéologiques
type: Class
subclass of: Lieu dit non habité
subclass of: Pai culture loisirs
comment: Vestiges archéologiques, fouilles, tumulus, oppidum.

Voie ferrée
type: Class
subclass of: Pai transport
comment: Voie ferrée nommée.

Volcan
type: Class
subclass of: Pai orographie
comment: Toute forme de relief témoignant d?une activité volcanique : cratère, volcan.

Zone industrielle
type: Class
subclass of: Pai industriel et commercial
subclass of: Toponyme divers
comment: Regroupement d'activités de production sur l?initiative des collectivités locales ou d'organismes parapublics (chambres de commerce et d'industrie) et portant un nom : zone artisanale, zone industrielle. Les sites dont la superficie est inférieure à 5 ha sont généralement exclus.